{"text_format":"1","workbook":"xlsx","n_sheets":9,"sheets":["Velkommen","Gantt-diagram","Eksempel på Gantt-diagram","Liste over leveringstyper","Valideringer","Samlet budgetoversigt","Eksempel på individuelt projekt","Eksempel på samarbejdsprojekt","Liste over tilskudsprocenter"],"not_rendered":{"charts":0,"images":0,"macros":1,"external_links":1,"defined_names":4,"comments":0,"pivot_tables":0},"unopened":[],"bounds":{"document_bytes":16777216,"sheet_cells":100000,"rows_first":2000,"rows_last":500,"rows_between":2000,"halvings":0,"cell_chars":16384,"cell_head_chars":4096},"cells_cut":0,"cells_raw":0,"read":"whole","date_system":"1900"}

{"sheet":"Velkommen","index":0,"n_rows":42,"n_cols":2,"rows_kept":42,"cut":false,"hidden":false,"merged":[[4,1,6,7],[8,1,9,7],[11,1,11,7],[15,1,17,7],[18,1,20,7],[33,1,36,7],[37,1,40,7],[41,1,43,7],[44,1,46,7],[12,1,14,7],[21,1,24,7],[25,1,25,7],[26,1,26,7],[27,1,28,7],[29,1,30,7],[32,1,32,7]]}
[]
[]
[]
[]
[null,"Hvis du får en gul bjælke foroven hvor den beder dig om at acceptere makroer eller ActiveX-objekter bedes du acceptere. Ellers virker ansøgningsskemaet ikke."]
[]
[]
[]
[null,"Hvilket slags projekt ansøger du om?"]
[]
[]
[null,"Samarbejdsprojekter"]
[null,"Samarbejdsprojekter har generelt højere satser end individuelle projekter. For at opnå forhøjet tilskud til samarbejdsprojekter skal projektet enten være: \n \n\n\n\nI samarbejdsprojekter er det et krav, at projektets resultater formidles bredt gennem konferencer, publikationer, open access-samlinger, gratis software eller open source-software. (Dette gælder dog ikke fortrolige oplysninger.)\n"]
[]
[]
[null,"• Et samarbejde mellem virksomheder, hvoraf mindst en deltager er en SMV, og hvor ingen virksomhed afholder mere end 70 pct. af det samlede GUDP tilskud, eller;"]
[]
[]
[null,"• Et samarbejde mellem virksomheder (uanset størrelse) og en forsknings- og vidensformidlingsinstitution, hvor sidstnævnte afholder mindst 10 pct. af GUDP tilskuddet."]
[]
{"$rows_left_out":23}
{"sheet":"Gantt-diagram","index":1,"n_rows":50,"n_cols":23,"rows_kept":50,"cut":false,"hidden":false,"merged":[[3,2,3,5],[3,6,3,9],[3,10,3,13],[3,14,3,17]]}
[]
["Gantt Diagram"]
[]
[null,null,"20XX",null,null,null,"20XX",null,null,null,"20XX",null,null,null,"20XX",null,null,null,"Aktivitetstype (F/U/D/N)"]
[null,"Involverede projektdeltagere","Jan","Apr","Jul","Okt","Jan","Apr","Jul ","Okt","Jan","Apr","Jul","Okt","Jan","Apr","Jul","Okt"," og leveringtype, se faneblad 3","Antal timer","AP budget"]
["AP 1: Navn på AP1"]
["1.1 "]
["1.2"]
["1.3"]
["Mv."]
[]
["Milepæle:"]
["M1.1:"]
["M 1.2:",null,null,null,null,null,null,null,null,null,null,null,null,null,null,null,null,null,null,"Samlet timetal:","Samlet budget:"]
["AP 2"]
["2.1",null,null,null,null,null,null,null,null,null,null,null,null,null,null,null,null,null,null,null,null,null," "]
["2.2"]
["2.3"]
[]
["Milepæle:"]
{"$rows_left_out":31}
{"sheet":"Eksempel på Gantt-diagram","index":2,"n_rows":62,"n_cols":21,"rows_kept":62,"cut":false,"hidden":false,"merged":[[4,2,4,5],[4,6,4,9],[4,10,4,13],[4,14,4,17]]}
[]
[]
["Eksempel på Gantt Diagram"]
[]
[null,null,2022,null,null,null,2023,null,null,null,2024,null,null,null,2025,null,null,null,"Aktivitetstype (F/U/D/N)"]
[null,"Involverede projektdeltagere","Jan","Apr","Jul","Okt","Jan","Apr","Jul ","Okt","Jan","Apr","Jul","Okt","Jan","Apr","Jul","Okt"," og leveringtype, se faneblad 3","Antal timer","AP budget"]
["AP 1: Forsøgsplanlægning","Navn på ansvarlig (Ansv.)",null,null,null,null,null,null,null,null,null,null,null,null,null,null,null,null,"U, F","Timetal virksomhed 1: 100"]
["1.1: Udvælgelse af xxxx","Deltager 1",null,null,null,null,null,null,null,null,null,null,null,null,null,null,null,null,null,"Timetal virksomhed 2: 225"]
["1.2: Møder med relevante fagpersoner","Deltager 2"]
["1.3: Samlet vurdering af xxxx","Deltager 3"]
[null,"Deltager 4"]
["Milepæle:"]
["M 1.1: Forsøgssetup",null,"x"]
["M 1.2: Møder med fagpersoner afholdt",null,"x"]
["M 1.3: Intern forsøgsprotokol udarbejdet",null,null,null,"UF1","FF2",null,null,null,null,null,null,null,null,null,null,null,null,"UF1 og FF2",null,"Samlet budget: 210.843 kr."]
[null,null,null,null,null,null,null,null,null,null,null,null,null,null,null,null,null,null,null,"Samlet timetal: 325","(inkl. OH)"]
["AP 2: Første undersøgelse","Navn på ansvarlig (Ansv.)",null,null,null,null,null,null,null,null,null,null,null,null,null,null,null,null,"F","Timetal virksomhed 1: 160"]
["2.1: Finde egnede besætninger","Deltager 1",null,null,null,null,null,null,null,null,null,null,null,null,null,null,null,null,null,"Timetal virksomhed 2: 310"]
["2.2: Udtage prøver","Deltager 2"]
["2.3: Analyse og vurdering af xxxx","Deltager 3"]
{"$rows_left_out":43}
{"sheet":"Liste over leveringstyper","index":3,"n_rows":48,"n_cols":8,"rows_kept":48,"cut":false,"hidden":false,"merged":[[20,4,20,5],[2,2,2,3],[8,2,8,3],[12,2,12,3],[15,4,15,5],[15,2,15,3],[4,4,4,5],[5,4,5,5],[6,4,6,5],[7,4,7,5],[8,4,8,5],[15,0,15,1],[1,6,1,7],[14,4,14,5],[9,4,9,5],[10,4,10,5],[0,0,0,7],[2,6,2,7],[11,4,11,5],[12,4,12,5],[13,4,13,5],[11,0,11,1],[1,0,1,1],[8,0,8,1],[2,0,2,1],[12,0,12,1],[1,2,1,3],[1,4,1,5],[2,4,2,5],[3,4,3,5]]}
["Lister over leveringstyper til brug ved udfyldelse af gantt-diagram til udviklings- og demonstrationsprojekter samt netværksprojekter"]
["ANVENDELSESORIENTERET FORSKNING",null,"UDVIKLING",null,"DEMONSTRATION",null,"NETVÆRK"]
["Videnskabelig produktion",null,"Nye produkter processer m.v.",null,"Nye produkter processer m.v.",null,"Leveringstyper"]
["Internationalt tidsskrift (peer reviewed)","FV1","Nye eller væsentligt forbedret produkt","UP1",null,null,"Potentielle udviklingsarbejder konkretiserede","N1"]
["Dansk tidsskrift","FV2","Nye eller væsentligt forbedret produktionsproces","UP2",null,null,"Analyser, udredninger, strategier udarbejdet","N2"]
["Proceedings og working papers","FV3","Nye koncepter m.v.","UP3",null,null,"Mindre udredninger/ notater udarbejdet","N3"]
["Forskningsrapport","FV4","Prototyper","UP4",null,null,"Kronikker, avisinterview, debatartikler","N4"]
["Konferenceindlæg","FV5","Pilotanlæg","UP5",null,null,"Artikler i fagtidsskrifter eller fagspecifikke aviser","N5"]
["Kommercialisering og anvendelse",null,"Kommercialisering og anvendelse",null,"Kommercialisering og anvendelse",null,"Nyhedsbreve","N6"]
["Strategisk metodeudvikling og myndighedsprocedure","FK2","Varemærkebeskyttelse","UK2",null,null,"Hjemmesider tilknyttet til netværket/partnerskabet","N7"]
["Anden form for kommercialisering","FK3","Certificering/test (ikke lovkrævet)","UK3",null,null,"Andet (beskrives særskilt)","N8"]
[null,null,"Anden form for kommercialisering, herunder ændringer i tekniske standarder, ændringer i rådgivningstandarder m.v.","UK4"]
["Softwareprogrammer ",null,"Softwareprogrammer ",null,"Softwareprogrammer "]
["Intern anvendelse","FS1","Intern anvendelse","US1"]
["Ekstern anvendelse","FS2","Ekstern anvendelse","US2"]
["Kommunikation og formidling",null,"Kommunikation og formidling",null,"Kommunikation og formidling"]
["Større udredninger og analyser, typisk over 50 sider","FF1","Større udredninger og analyser, typisk over 50 sider","UF1","Formidling via praktiske fremvisninger","DF1"]
["Mindre udredninger/ notater","FF2","Mindre udredninger/ notater","UF2","Tekniske manualer, factsheets og lign.","DF2"]
["Artikler i fagtidsskrifter og fagspecifikke aviser","FF3","Tekniske manualer, factsheets og lign.","UF3","Artikler i fagtidsskrifter og fagspecifikke aviser","DF3"]
["Temanumre i forbindelse med projekt","FF4","Artikler i fagtidsskrifter og fagspecifikke aviser","UF4","Temamøder / Workshop / Åbent hus arrangementer","DF4"]
{"$rows_left_out":29}
{"sheet":"Valideringer","index":4,"n_rows":8,"n_cols":5,"rows_kept":8,"cut":false,"hidden":false,"merged":[]}
[]
[null,"Virksomhedsstørrelse",null,"Aktivitetstype:"]
[null,"Individuel","Samarbejde","Individuel","Samarbejde"]
[null,"Offentlig forsknings- og vidensformidlingsorganisation","Offentlig forsknings- og vidensformidlingsorganisation","Anvendt forskning","Anvendt forskning"]
[null,"Privat forsknings- og vidensformidlingsorganisation","Privat forsknings- og vidensformidlingsorganisation","Udvikling","Udvikling"]
[null,"Lille virksomhed","Lille virksomhed","Demonstration","Demonstration"]
[null,"Mellemstor virksomhed","Mellemstor virksomhed","Netværk","Netværk"]
[null,"Stor virksomhed","Stor virksomhed"]

{"sheet":"Samlet budgetoversigt","index":5,"n_rows":395,"n_cols":17,"rows_kept":395,"cut":false,"hidden":false,"merged":[[1,3,1,4],[110,4,110,5],[3,8,3,10],[4,8,4,10],[15,4,15,5],[34,4,34,5],[53,4,53,5],[72,4,72,5],[91,4,91,5],[129,4,129,5],[148,4,148,5],[167,4,167,5],[186,4,186,5],[205,4,205,5],[319,4,319,5],[338,4,338,5],[357,4,357,5],[376,4,376,5],[224,4,224,5],[243,4,243,5],[262,4,262,5],[281,4,281,5],[300,4,300,5]]}
["Projekttitel:"]
[null,null,null,"Projektets totalbudget udfyldes automatisk"]
[null,"Omkostninger","Heraf GUDP","Heraf egen-og privat finansiering","Heraf anden offentlig støtte - manuel","Antal timer"]
["Lønomkostninger",{"$f":"B23+B42+B61+B80+B99+B118+B137+B156+B175+B194+B213+B232+B251+B270+B289+B308+B327+B346+B365+B384","v":0},0,0,null,{"$f":"F23+F42+F61+F80+F99+F118+F137+F156+F175+F194+F213+F232+F251+F270+F289+F308+F327+F346+F365+F384","v":0},null,null,"Journal nr: 34009-24-XXXX"]
["Ekstern bistand",0,0,0,null,0,null,null,"Godkendt fra: XX-XX-XXXX"]
["Øvrige omkostninger",0,0,0,null,0]
["Apparatur/udstyr",0,0,0,null,0]
["Scrap-værdi",0,0,0,null,0]
["Evt. indtægter",0,0,0,null,0]
["Revision",0,0,0,null,0]
["I alt uden OH",0,0,0,null,0]
["OH",0,0,0,null,0]
["I alt",0,0,0,null,0]
["Finansiering i alt",{"$f":"IFERROR(B34+B53+B72+B91+B110+B129+B148+B167+B186+B205+B224+B243+B262+B281+B300+B319+B338+B357+B376+B395,\"\")","v":0},{"$f":"IFERROR(C34+C53+C72+C91+C110+C129+C148+C167+C186+C205+C224+C243+C262+C281+C300+C319+C338+C357+C376+C395,\"\")","v":0},{"$f":"IFERROR(D34+D53+D72+D91+D110+D129+D148+D167+D186+D205+D224+D243+D262+D281+D300+D319+D338+D357+D376+D395,\"\")","v":0},0,{"$f":"IFERROR(F33+F52+F71+F90+F109+F128+F147+F166+F185+F204+F223+F242+F261+F280+F299+F318+F337+F356+F375+F394,\"\")","v":""}]
[]
["Virksomhedsnavn:",null,"Hovedansøger","Virksomhedsstørrelse:"]
["Aktivitetstype:",null,null,"Max mulig GUDP tilskudsprocent:",{"$f":"IF(G19<0,\"Anden offentlig støtte overstiger GUDP max tilskudsbeløb\",_xlfn.IFNA(VLOOKUP(B17,'Liste over tilskudsprocenter'!$A:$K,MATCH(CONCATENATE(E16,\" - \",$H$1),'Liste over tilskudsprocenter'!$A$1:$K$1,0),FALSE),\"\"))","v":""},"Nedskrevet GUDP tilskudsprocent pga. \nanden offentlig støtte el. egen- og privat finansiering:",{"$f":"IFERROR(IF(G19<0,\"Anden offentlig støtte overstiger GUDP max tilskudsbeløb\",IF(G19=E19,\"\",G19)),\"\")","v":""},{"$f":"IF(E16=\"\",0,IF(LEFT(E16,9)=\"Offentlig\",B30*0.44,B23*0.3))","v":0}]
[null,null,null,"Max mulig GUDP tilsagnsbeløb:",{"$f":"IFERROR(VLOOKUP(B17,'Liste over tilskudsprocenter'!$A:$K,MATCH(CONCATENATE(E16,\" - \",$H$1),'Liste over tilskudsprocenter'!$A$1:$K$1,0),FALSE)*B32,\"\")","v":""},"Nedskrevet GUDP tilskudsbeløb pga. \nanden offentlig støtte el. egen- og privat finansiering:",{"$f":"IFERROR(B32*G17,\"\")","v":""}]
["OH-procentsats",{"$f":"IF(E16=\"\",\"\",IF(E16=\"Offentlig forsknings- og vidensformidlingsorganisation\",0.44,IF(E16=\"Privat forsknings- og vidensformidlingsorganisation\",0.44,0.3)))","v":""},null,null,{"$f":"_xlfn.IFNA(VLOOKUP(B17,'Liste over tilskudsprocenter'!$A:$K,MATCH(CONCATENATE(E16,\" - \",$H$1),'Liste over tilskudsprocenter'!$A$1:$K$1,0),FALSE),\"\")","v":""},null,{"$f":"IFERROR(IF(B32*(1-E19)-D33-E33<0,E19-((B32*E19+E33+D33)-B32)/B32,\"\"),\"\")","v":""}]
["OH-rest beløb",{"$f":"IF(E16=\"\",\"\",IF(OR(LEFT(E16,9)=\"Offentlig\",LEFT(E16,6)=\"Privat\"),B30*0.44-B31,B23*0.3-B31))","v":""}]
{"$rows_left_out":376}
{"sheet":"Eksempel på individuelt projekt","index":6,"n_rows":395,"n_cols":17,"rows_kept":395,"cut":false,"hidden":false,"merged":[[167,4,167,5],[186,4,186,5],[205,4,205,5],[224,4,224,5],[1,3,1,4],[110,4,110,5],[72,4,72,5],[91,4,91,5],[129,4,129,5],[148,4,148,5],[3,8,3,10],[4,8,4,10],[15,4,15,5],[34,4,34,5],[53,4,53,5],[338,4,338,5],[357,4,357,5],[376,4,376,5],[243,4,243,5],[262,4,262,5],[281,4,281,5],[300,4,300,5],[319,4,319,5]]}
["Projekttitel:","Eksempel på budget med en virksomhed med to aktivitetstyper",null,null,null,null,null,"Samarbejde"]
[null,null,null,"Projektets totalbudget udfyldes automatisk"]
[null,"Omkostninger","Heraf GUDP","Heraf egen-og privat finansiering","Heraf anden offentlig støtte - manuel","Antal timer"]
["Lønomkostninger",{"$f":"B23+B42+B61+B80+B99+B118+B137+B156+B175+B194+B213+B232+B251+B270+B289+B308+B327+B346+B365+B384","v":950000},580000,370000,null,{"$f":"F23+F42+F61+F80+F99+F118+F137+F156+F175+F194+F213+F232+F251+F270+F289+F308+F327+F346+F365+F384","v":3043},null,null,"Journal nr: 34009-24-XXXX"]
["Ekstern bistand",16700,10020,6680,null,0,null,null,"Godkendt fra: XX-XX-XXXX"]
["Øvrige omkostninger",150000,95000,55000,null,0]
["Apparatur/udstyr",50000,30000,20000,null,0]
["Scrap-værdi",-10000,-6000,-4000,null,0]
["Evt. indtægter",-5000,-3000,-2000,null,0]
["Revision",36000,23400,12600,null,0]
["I alt uden OH",1187700,729420,458280,null,3043]
["OH",285000,174000,111000,null,0]
["I alt",1472700,903420,569280,null,3043]
["Finansiering i alt",{"$f":"IFERROR(B34+B53+B72+B91+B110+B129+B148+B167+B186+B205+B224+B243+B262+B281+B300+B319+B338+B357+B376+B395,\"\")","v":1472700},{"$f":"IFERROR(C34+C53+C72+C91+C110+C129+C148+C167+C186+C205+C224+C243+C262+C281+C300+C319+C338+C357+C376+C395,\"\")","v":903420},569280,0,{"$f":"IFERROR(F33+F52+F71+F90+F109+F128+F147+F166+F185+F204+F223+F242+F261+F280+F299+F318+F337+F356+F375+F394,\"\")","v":""}]
[]
["Virksomhedsnavn:","Den lille grønne virksomhed","Hovedansøger","Virksomhedsstørrelse:","Lille virksomhed"]
["Aktivitetstype:","Udvikling",null,"Max mulig GUDP tilskudsprocent:",{"$f":"IF(G19<0,\"Anden offentlig støtte overstiger GUDP max tilskudsbeløb\",_xlfn.IFNA(VLOOKUP(B17,'Liste over tilskudsprocenter'!$A:$K,MATCH(CONCATENATE(E16,\" - \",$H$1),'Liste over tilskudsprocenter'!$A$1:$K$1,0),FALSE),\"\"))","v":0.6},"Nedskrevet GUDP tilskudsprocent pga. \nanden offentlig støtte:",{"$f":"IFERROR(IF(G19<0,\"Anden offentlig støtte overstiger GUDP max tilskudsbeløb\",IF(G19=E19,\"\",G19)),\"\")","v":""},{"$f":"IF(E16=\"\",0,IF(LEFT(E16,9)=\"Offentlig\",B30*0.44,B23*0.3))","v":255000}]
[null,null,null,"Max mulig GUDP tilsagnsbeløb:",{"$f":"IFERROR(VLOOKUP(B17,'Liste over tilskudsprocenter'!$A:$K,MATCH(CONCATENATE(E16,\" - \",$H$1),'Liste over tilskudsprocenter'!$A$1:$K$1,0),FALSE)*B32,\"\")","v":764820},"Nedskrevet GUDP tilskudsbeløb pga. \nanden offentlig støtte:",{"$f":"IFERROR(B32*G17,\"\")","v":""}]
["OH-procentsats",{"$f":"IF(E16=\"\",\"\",IF(E16=\"Offentlig forsknings- og vidensformidlingsorganisation\",0.44,IF(E16=\"Privat forsknings- og vidensformidlingsorganisation\",0.44,0.3)))","v":0.3},null,null,{"$f":"_xlfn.IFNA(VLOOKUP(B17,'Liste over tilskudsprocenter'!$A:$K,MATCH(CONCATENATE(E16,\" - \",$H$1),'Liste over tilskudsprocenter'!$A$1:$K$1,0),FALSE),\"\")","v":0.6},null,{"$f":"IFERROR(IF(B32*(1-E19)-E33<0,E19-((B32*E19+E33)-B32)/B32,\"\"),\"\")","v":""}]
["OH-rest beløb",{"$f":"IF(E16=\"\",\"\",IF(OR(LEFT(E16,9)=\"Offentlig\",LEFT(E16,6)=\"Privat\"),B30*0.44-B31,B23*0.3-B31))","v":0}]
{"$rows_left_out":376}
{"sheet":"Eksempel på samarbejdsprojekt","index":7,"n_rows":395,"n_cols":17,"rows_kept":395,"cut":false,"hidden":false,"merged":[[167,4,167,5],[186,4,186,5],[205,4,205,5],[224,4,224,5],[1,3,1,4],[110,4,110,5],[72,4,72,5],[91,4,91,5],[129,4,129,5],[148,4,148,5],[3,8,3,10],[4,8,4,10],[15,4,15,5],[34,4,34,5],[53,4,53,5],[338,4,338,5],[357,4,357,5],[376,4,376,5],[243,4,243,5],[262,4,262,5],[281,4,281,5],[300,4,300,5],[319,4,319,5]]}
["Projekttitel:","Eksempel på samarbejdsprojekt med 3 deltagere",null,null,null,null,null,"Samarbejde"]
[null,null,null,"Projektets totalbudget udfyldes automatisk"]
[null,"Omkostninger","Heraf GUDP","Heraf egen-og privat finansiering","Heraf anden offentlig støtte - manuel","Antal timer"]
["Lønomkostninger",{"$f":"B23+B42+B61+B80+B99+B118+B137+B156+B175+B194+B213+B232+B251+B270+B289+B308+B327+B346+B365+B384","v":2900000},2335000,565000,null,{"$f":"F23+F42+F61+F80+F99+F118+F137+F156+F175+F194+F213+F232+F251+F270+F289+F308+F327+F346+F365+F384","v":7769},null,null,"Journal nr: 34009-24-XXXX"]
["Ekstern bistand",30000,18000,12000,null,0,null,null,"Godkendt fra: XX-XX-XXXX"]
["Øvrige omkostninger",400000,320000,80000,null,0]
["Apparatur/udstyr",50000,30000,20000,null,0]
["Scrap-værdi",-10000,-6000,-4000,null,0]
["Evt. indtægter",-5000,-3000,-2000,null,0]
["Revision",52000,37800,14200,null,0]
["I alt uden OH",3417000,2731800,685200,null,7769]
["OH",1225000,1020000,205000,null,0]
["I alt",4642000,3751800,602200,null,7769]
["Finansiering i alt",{"$f":"IFERROR(B34+B53+B72+B91+B110+B129+B148+B167+B186+B205+B224+B243+B262+B281+B300+B319+B338+B357+B376+B395,\"\")","v":4642000},{"$f":"IFERROR(C34+C53+C72+C91+C110+C129+C148+C167+C186+C205+C224+C243+C262+C281+C300+C319+C338+C357+C376+C395,\"\")","v":3751800},602200,288000,{"$f":"IFERROR(F33+F52+F71+F90+F109+F128+F147+F166+F185+F204+F223+F242+F261+F280+F299+F318+F337+F356+F375+F394,\"\")","v":""}]
[]
["Virksomhedsnavn:","Lille grøn virksomhed","Hovedansøger","Virksomhedsstørrelse:","Lille virksomhed"]
["Aktivitetstype:","Udvikling",null,"Max mulig GUDP tilskudsprocent:",{"$f":"IF(G19<0,\"Anden offentlig støtte overstiger GUDP max tilskudsbeløb\",_xlfn.IFNA(VLOOKUP(B17,'Liste over tilskudsprocenter'!$A:$K,MATCH(CONCATENATE(E16,\" - \",$H$1),'Liste over tilskudsprocenter'!$A$1:$K$1,0),FALSE),\"\"))","v":0.6},"Nedskrevet GUDP tilskudsprocent pga. \nanden offentlig støtte el. egen- og privat finansiering:",{"$f":"IFERROR(IF(G19<0,\"Anden offentlig støtte overstiger GUDP max tilskudsbeløb\",IF(G19=E19,\"\",G19)),\"\")","v":""},{"$f":"IF(E16=\"\",0,IF(LEFT(E16,9)=\"Offentlig\",B30*0.44,B23*0.3))","v":255000}]
[null,null,null,"Max mulig GUDP tilsagnsbeløb:",{"$f":"IFERROR(VLOOKUP(B17,'Liste over tilskudsprocenter'!$A:$K,MATCH(CONCATENATE(E16,\" - \",$H$1),'Liste over tilskudsprocenter'!$A$1:$K$1,0),FALSE)*B32,\"\")","v":772800},"Nedskrevet GUDP tilskudsbeløb pga. \nanden offentlig støtte el. egen- og privat finansiering:",{"$f":"IFERROR(B32*G17,\"\")","v":""}]
["OH-procentsats",{"$f":"IF(E16=\"\",\"\",IF(E16=\"Offentlig forsknings- og vidensformidlingsorganisation\",0.44,IF(E16=\"Privat forsknings- og vidensformidlingsorganisation\",0.44,0.3)))","v":0.3},null,null,{"$f":"_xlfn.IFNA(VLOOKUP(B17,'Liste over tilskudsprocenter'!$A:$K,MATCH(CONCATENATE(E16,\" - \",$H$1),'Liste over tilskudsprocenter'!$A$1:$K$1,0),FALSE),\"\")","v":0.6},null,{"$f":"IFERROR(IF(B32*(1-E19)-E33<0,E19-((B32*E19+E33)-B32)/B32,\"\"),\"\")","v":""}]
["OH-rest beløb",{"$f":"IF(E16=\"\",\"\",IF(OR(LEFT(E16,9)=\"Offentlig\",LEFT(E16,6)=\"Privat\"),B30*0.44-B31,B23*0.3-B31))","v":0}]
{"$rows_left_out":376}
{"sheet":"Liste over tilskudsprocenter","index":8,"n_rows":7,"n_cols":11,"rows_kept":7,"cut":false,"hidden":false,"merged":[]}
[null,"Offentlig forsknings- og vidensformidlingsorganisation - Individuel","Offentlig forsknings- og vidensformidlingsorganisation - Samarbejde","Privat forsknings- og vidensformidlingsorganisation - Individuel","Privat forsknings- og vidensformidlingsorganisation - Samarbejde","Lille virksomhed - Individuel","Lille virksomhed - Samarbejde","Mellemstor virksomhed - Individuel","Mellemstor virksomhed - Samarbejde","Stor virksomhed - Individuel","Stor virksomhed - Samarbejde"]
["Anvendt forskning",0.9,0.9,0.9,0.9,0.7,0.8,0.6,0.75,0.5,0.65]
["Udvikling",0.9,0.9,0.9,0.9,0.45,0.6,0.35,0.5,0.25,0.4]
["Demonstration",0.7,0.7,0.7,0.7,0.7,0.7,0.7,0.7,0.7,0.7]
["Netværk",0.5,0.5,0.5,0.5,0.5,0.5,0.5,0.5,0.5,0.5]
["*Virksomheder må aldrig have medfinansiering med andre offentlige midler"]
["*Offentlig forsknings og vidensformidlingsorganisationer må aldrig have medfinansiering med egne midler"]